BDBM50226230 CHEMBL50084
SMILES CCCOc1ccnc(n1)N1CCN(CC1)c1nc(N)c2cc(OC)c(OC)cc2n1
InChI Key InChIKey=SBJDZAKXFLMWAH-UHFFFAOYSA-N
Data  1 KI
  Tab Delimited (TSV)   2D SDfile   Computed 3D by Vconf -m prep SDfile
Find this compound or compounds like it in BindingDB:
Activity Spreadsheet -- Enzyme Inhibition Constant Data from BindingDB
Found 1 hit for monomerid = 50226230
TargetAlpha-1A/Alpha-1B/Alpha-1D adrenergic receptor(Rattus norvegicus (rat))
Pfizer
Curated by ChEMBL
LigandPNGBDBM50226230(CHEMBL50084)
Affinity DataKi:  0.320nM. Assay description: Binding affinity against alpha-1-adrenoceptor in rat brain homogenates [3H]-prazosin displacement.
In DepthDetails ArticlePubMed