BDBM50226237 CHEMBL299584
SMILES COc1cc2nc(nc(N)c2cc1OC)N1CCN(CC1)c1ccnc(Oc2ccccc2)n1
InChI Key InChIKey=MCHCYKBJGPVHJQ-UHFFFAOYSA-N
Data  1 KI
  Tab Delimited (TSV)   2D SDfile   Computed 3D by Vconf -m prep SDfile
Find this compound or compounds like it in BindingDB:
Activity Spreadsheet -- Enzyme Inhibition Constant Data from BindingDB
Found 1 hit for monomerid = 50226237
TargetAlpha-1A/Alpha-1B/Alpha-1D adrenergic receptor(Rattus norvegicus (rat))
Pfizer
Curated by ChEMBL
LigandPNGBDBM50226237(CHEMBL299584)
Affinity DataKi:  0.240nM. Assay description: Binding affinity against alpha-1-adrenoceptor in rat brain homogenates [3H]-prazosin displacement.
In DepthDetails ArticlePubMed