BDBM50226609 (S)-2-(2-aminoethylamino)-3-(1-isopropyl-1H-imidazol-4-yl)propanoic acid::CHEMBL397625
SMILES CC(C)n1cnc(C[C@H](NCCN)C(O)=O)c1
InChI Key InChIKey=DSCXKBLEKKGFNS-JTQLQIEISA-N
Data  1 KI
  Tab Delimited (TSV)   2D SDfile   Computed 3D by Vconf -m prep SDfile
Find this compound or compounds like it in BindingDB:
Activity Spreadsheet -- Enzyme Inhibition Constant Data from BindingDB
Found 1 hit for monomerid = 50226609
TargetCarboxypeptidase B2(Homo sapiens (Human))
Pfizer
Curated by ChEMBL
LigandPNGBDBM50226609((S)-2-(2-aminoethylamino)-3-(1-isopropyl-1H-imidaz...)
Affinity DataKi:  430nM. Assay description: Inhibition of human TAFIa
In DepthDetails ArticlePubMed