BDBM50226617 CHEMBL110567
SMILES CC(C)[C@@H]1N2Cc3cc(OCCCC(=O)N(C)C4CCCCC4)ccc3N=C2NC1=O
InChI Key InChIKey=KGQKTTUVOJAYFB-QFIPXVFZSA-N
Data  1 IC50
  Tab Delimited (TSV)   2D SDfile   Computed 3D by Vconf -m prep SDfile
Find this compound or compounds like it in BindingDB:
Activity Spreadsheet -- Enzyme Inhibition Constant Data from BindingDB
Found 1 hit for monomerid = 50226617
TargetcGMP-inhibited 3',5'-cyclic phosphodiesterase 3A/3B(Homo sapiens (Human))
TBA
Curated by ChEMBL
LigandPNGBDBM50226617(CHEMBL110567)
Affinity DataIC50: >1.00E+4nM. Assay description: In vivo inhibition of cyclic AMP phosphodiesterase from human platelets
In DepthDetails ArticlePubMed