BDBM50226922 CHEMBL543535
SMILES Cl.CC1CN=C(CC2=C(C)c3ccccc3CC2)N1
InChI Key InChIKey=INMQEMHNQXSEFB-UHFFFAOYSA-N
Data  1 KI
  Tab Delimited (TSV)   2D SDfile   Computed 3D by Vconf -m prep SDfile
Find this compound or compounds like it in BindingDB:
Activity Spreadsheet -- Enzyme Inhibition Constant Data from BindingDB
Found 1 hit for monomerid = 50226922
LigandPNGBDBM50226922(CHEMBL543535)
Affinity DataKi: >800nM. Assay description: Ability to displace [3H]clonidine from alpha-2 adrenergic receptor in rat brain homogenates in vitro
In DepthDetails ArticlePubMed