BDBM50226931 CHEMBL553368
SMILES Cl.CCN1CCN=C1CC1=C(C)c2ccccc2CC1
InChI Key InChIKey=MVXDLSVGNXINCR-UHFFFAOYSA-N
Data  1 KI
  Tab Delimited (TSV)   2D SDfile   Computed 3D by Vconf -m prep SDfile
Find this compound or compounds like it in BindingDB:
Activity Spreadsheet -- Enzyme Inhibition Constant Data from BindingDB
Found 1 hit for monomerid = 50226931
LigandPNGBDBM50226931(CHEMBL553368)
Affinity DataKi:  548nM. Assay description: Ability to displace [3H]clonidine from alpha-2 adrenergic receptor in rat brain homogenates in vitro
In DepthDetails ArticlePubMed