BDBM50227200 CHEMBL66978
SMILES Ic1ccc2N=C3NC(=O)CN3Cc2c1
InChI Key InChIKey=JJEAICNWSUWOMH-UHFFFAOYSA-N
Data  1 IC50
  Tab Delimited (TSV)   2D SDfile   Computed 3D by Vconf -m prep SDfile
Find this compound or compounds like it in BindingDB:
Activity Spreadsheet -- Enzyme Inhibition Constant Data from BindingDB
Found 1 hit for monomerid = 50227200
TargetcGMP-inhibited 3',5'-cyclic phosphodiesterase 3A/3B(Homo sapiens (Human))
Syntex Research
Curated by ChEMBL
LigandPNGBDBM50227200(CHEMBL66978)
Affinity DataIC50:  520nM. Assay description: Inhibition of platelet cAMP phosphodiesterase
In DepthDetails ArticlePubMed