BDBM50227504 3-trifluoromethyl-1,2,3,4-tetrahydro-benzo[4,5]thieno[3,2-c]pyridine::CHEMBL399864
SMILES FC(F)(F)C1Cc2sc3ccccc3c2CN1
InChI Key InChIKey=BINHMIVCPQARJW-UHFFFAOYSA-N
Data  1 KI
  Tab Delimited (TSV)   2D SDfile   Computed 3D by Vconf -m prep SDfile
Find this compound or compounds like it in BindingDB:
Activity Spreadsheet -- Enzyme Inhibition Constant Data from BindingDB
Found 1 hit for monomerid = 50227504
TargetPhenylethanolamine N-methyltransferase(Homo sapiens (Human))
The University Of Kansas
Curated by ChEMBL
LigandPNGBDBM50227504(3-trifluoromethyl-1,2,3,4-tetrahydro-benzo[4,5]thi...)
Affinity DataKi:  1.70E+4nM. Assay description: Inhibition of human PNMT by radiochemical assay
In DepthDetails ArticlePubMed