BDBM50227505 (S)-6-methyl-4,5,6,7-tetrahydrothieno[3,2-c]pyridine-2-carbonitrile::CHEMBL252808
SMILES C[C@H]1Cc2sc(cc2CN1)C#N
InChI Key InChIKey=MOVILGRNUBEACK-LURJTMIESA-N
Data  1 KI
  Tab Delimited (TSV)   2D SDfile   Computed 3D by Vconf -m prep SDfile
Find this compound or compounds like it in BindingDB:
Activity Spreadsheet -- Enzyme Inhibition Constant Data from BindingDB
Found 1 hit for monomerid = 50227505
TargetPhenylethanolamine N-methyltransferase(Homo sapiens (Human))
The University Of Kansas
Curated by ChEMBL
LigandPNGBDBM50227505((S)-6-methyl-4,5,6,7-tetrahydrothieno[3,2-c]pyridi...)
Affinity DataKi:  3.30E+3nM. Assay description: Inhibition of human PNMT by radiochemical assay
In DepthDetails ArticlePubMed