BDBM50227509 1-THIEN-3-YLMETHANAMINE::CHEMBL252602::thiophen-3-ylmethanamine
SMILES NCc1ccsc1
InChI Key InChIKey=DUDAKCCDHRNMDJ-UHFFFAOYSA-N
Data  1 KI
PDB links: 1 PDB ID matches this monomer.
  Tab Delimited (TSV)   2D SDfile   Computed 3D by Vconf -m prep SDfile
Find this compound or compounds like it in BindingDB:
Activity Spreadsheet -- Enzyme Inhibition Constant Data from BindingDB
Found 1 hit for monomerid = 50227509
TargetPhenylethanolamine N-methyltransferase(Homo sapiens (Human))
The University Of Kansas
Curated by ChEMBL
LigandPNGBDBM50227509(1-THIEN-3-YLMETHANAMINE | CHEMBL252602 | thiophen-...)
Affinity DataKi:  1.10E+5nM. Assay description: Inhibition of human PNMT by radiochemical assay
In DepthDetails ArticlePubMed