BDBM50227517 2-bromo-6-methyl-4,5,6,7-tetrahydrothieno[3,2-c]pyridine::CHEMBL253218
SMILES CC1Cc2sc(Br)cc2CN1
InChI Key InChIKey=QBDCIRLVCYUICX-UHFFFAOYSA-N
Data  1 KI
  Tab Delimited (TSV)   2D SDfile   Computed 3D by Vconf -m prep SDfile
Find this compound or compounds like it in BindingDB:
Activity Spreadsheet -- Enzyme Inhibition Constant Data from BindingDB
Found 1 hit for monomerid = 50227517
TargetPhenylethanolamine N-methyltransferase(Homo sapiens (Human))
The University Of Kansas
Curated by ChEMBL
LigandPNGBDBM50227517(2-bromo-6-methyl-4,5,6,7-tetrahydrothieno[3,2-c]py...)
Affinity DataKi:  730nM. Assay description: Inhibition of human PNMT by radiochemical assay
In DepthDetails ArticlePubMed