BDBM50228042 CHEMBL323548
SMILES N[C@@H](Cc1ccc(O)cc1)C(=O)N[C@@H](CS)C(=O)NCC(=O)N[C@@H](Cc1ccc(cc1)[N+]([O-])=O)C(=O)N[C@H](CS)C(N)=O
InChI Key InChIKey=SRDLINCJTYFHGZ-BURNTYAHSA-N
Data  1 IC50
  Tab Delimited (TSV)   2D SDfile   Computed 3D by Vconf -m prep SDfile
Find this compound or compounds like it in BindingDB:
Activity Spreadsheet -- Enzyme Inhibition Constant Data from BindingDB
Found 1 hit for monomerid = 50228042
TargetDelta-type opioid receptor(Rattus norvegicus (rat))
Smith Kline And French Laboratories
Curated by ChEMBL
LigandPNGBDBM50228042(CHEMBL323548)
Affinity DataIC50:  0.0187nM. Assay description: The compound was tested for the ability to displace delta-receptor specific radioligand [3H]DPDPE
In DepthDetails ArticlePubMed