BDBM50228341 CHEMBL303125
SMILES CCCCCc1nc2c(N)ncnc2n1-c1ccccc1
InChI Key InChIKey=NHNHVPDCKSXJEL-UHFFFAOYSA-N
Data  1 KI  1 IC50
  Tab Delimited (TSV)   2D SDfile   Computed 3D by Vconf -m prep SDfile
Find this compound or compounds like it in BindingDB:
Activity Spreadsheet -- Enzyme Inhibition Constant Data from BindingDB
Found 2 hits for monomerid = 50228341
TargetPhosphatidylinositol 4-kinase type 2-alpha(Homo sapiens (Human))
Smith Kline & French Research
Curated by ChEMBL
LigandPNGBDBM50228341(CHEMBL303125)
Affinity DataKi:  3.58E+4nM. Assay description: Binding affinity (Ki) against human phosphatidylinositol 4-kinase
In DepthDetails ArticlePubMed
TargetPhosphatidylinositol 4-kinase type 2-alpha(Homo sapiens (Human))
Smith Kline & French Research
Curated by ChEMBL
LigandPNGBDBM50228341(CHEMBL303125)
Affinity DataIC50:  5.19E+4nM. Assay description: Inhibitory activity (IC50) against human phosphatidylinositol 4-kinase at the ATP binding site
In DepthDetails ArticlePubMed