BDBM50228489 CHEMBL62828
SMILES CCCCCc1nc2[nH]cnc(N)c2n1
InChI Key InChIKey=MRHGFFMYCHFGNP-UHFFFAOYSA-N
Data  1 KI  1 IC50
  Tab Delimited (TSV)   2D SDfile   Computed 3D by Vconf -m prep SDfile
Find this compound or compounds like it in BindingDB:
Activity Spreadsheet -- Enzyme Inhibition Constant Data from BindingDB
Found 2 hits for monomerid = 50228489
TargetPhosphatidylinositol 4-kinase type 2-alpha(Homo sapiens (Human))
Smith Kline & French Research
Curated by ChEMBL
LigandPNGBDBM50228489(CHEMBL62828)
Affinity DataKi:  4.75E+4nM. Assay description: Binding affinity (Ki) against human phosphatidylinositol 4-kinase
In DepthDetails ArticlePubMed
TargetPhosphatidylinositol 4-kinase type 2-alpha(Homo sapiens (Human))
Smith Kline & French Research
Curated by ChEMBL
LigandPNGBDBM50228489(CHEMBL62828)
Affinity DataIC50:  6.89E+4nM. Assay description: Inhibitory activity (IC50) against human phosphatidylinositol 4-kinase at the ATP binding site
In DepthDetails ArticlePubMed