BDBM50228499 CHEMBL305102
SMILES COc1ccc(cc1)-n1cnc2c(N)ncnc12
InChI Key InChIKey=YMODPHYHXIOBEG-UHFFFAOYSA-N
Data  1 KI  1 IC50
  Tab Delimited (TSV)   2D SDfile   Computed 3D by Vconf -m prep SDfile
Find this compound or compounds like it in BindingDB:
Activity Spreadsheet -- Enzyme Inhibition Constant Data from BindingDB
Found 2 hits for monomerid = 50228499
TargetPhosphatidylinositol 4-kinase type 2-alpha(Homo sapiens (Human))
Smith Kline & French Research
Curated by ChEMBL
LigandPNGBDBM50228499(CHEMBL305102)
Affinity DataKi:  1.52E+4nM. Assay description: Binding affinity (Ki) against human phosphatidylinositol 4-kinase
In DepthDetails ArticlePubMed
TargetPhosphatidylinositol 4-kinase type 2-alpha(Homo sapiens (Human))
Smith Kline & French Research
Curated by ChEMBL
LigandPNGBDBM50228499(CHEMBL305102)
Affinity DataIC50:  2.19E+4nM. Assay description: Inhibitory activity (IC50) against human phosphatidylinositol 4-kinase at the ATP binding site
In DepthDetails ArticlePubMed