BDBM50228557 CHEMBL99718
SMILES OC(CNCCOc1ccc(cc1)-n1ccnc1)CONC(C1CC1)C1CC1
InChI Key InChIKey=HGCGMLMLJKAOHO-UHFFFAOYSA-N
Data  1 IC50
  Tab Delimited (TSV)   2D SDfile   Computed 3D by Vconf -m prep SDfile
Find this compound or compounds like it in BindingDB:
Activity Spreadsheet -- Enzyme Inhibition Constant Data from BindingDB
Found 1 hit for monomerid = 50228557
TargetBeta-1/Beta-2/Beta-3 adrenergic receptor(Homo sapiens (Human))
Berlex Laboratories
Curated by ChEMBL
LigandPNGBDBM50228557(CHEMBL99718)
Affinity DataIC50:  300nM. Assay description: Tested for beta-receptor binding inhibition from canine ventricular tissue, using [3H]dihydroalprenolol as the radioligand in anesthetized dogs
In DepthDetails ArticlePubMed