BDBM50228719 CHEMBL74825
SMILES CCOC(=O)Cc1cccc(C(=O)c2ccc(Cl)cc2)c1N
InChI Key InChIKey=QFCOHPBSEIRXOL-UHFFFAOYSA-N
Data  1 IC50
  Tab Delimited (TSV)   2D SDfile   Computed 3D by Vconf -m prep SDfile
Find this compound or compounds like it in BindingDB:
Activity Spreadsheet -- Enzyme Inhibition Constant Data from BindingDB
Found 1 hit for monomerid = 50228719
TargetProstaglandin G/H synthase 1/2(RAT)
A.H. Robins
Curated by ChEMBL
LigandPNGBDBM50228719(CHEMBL74825)
Affinity DataIC50:  7.30E+4nM. Assay description: Inhibitory activity against Prostaglandin G/H synthase
In DepthDetails ArticlePubMed