BDBM50228761 (S)-2-(2-(3-chlorophenyl)-2-oxoacetamido)-N-((S)-5-guanidino-1-oxo-1-(thiazol-2-yl)pentan-2-yl)-3-methylbutanamide::(S)-2-[2-(3-chloro-phenyl)-2-oxo-acetylamino]-N-[(S)-4-guanidino-1-(thiazole-2-carbonyl)-butyl]-3-methyl-butyramide::2-[2-(3-CHLORO-PHENYL)-2-HYDROXY-ACETYLAMINO]-N-[4-GUANIDINO-1-(THIAZOLE-2-CARBONYL)-BUTYL]-3-METHYL-BUTYRAMIDE::CHEMBL429733
SMILES [#6]-[#6](-[#6])-[#6@H](-[#7]-[#6](=O)-[#6](=O)-c1cccc(Cl)c1)-[#6](=O)-[#7]-[#6@@H](-[#6]-[#6]-[#6]\[#7]=[#6](\[#7])-[#7])-[#6](=O)-c1nccs1
InChI Key InChIKey=NZMZDRVEUJTADA-HOTGVXAUSA-N
Data  2 IC50
  Tab Delimited (TSV)   2D SDfile   Computed 3D by Vconf -m prep SDfile
Find this compound or compounds like it in BindingDB:
Activity Spreadsheet -- Enzyme Inhibition Constant Data from BindingDB
Found 2 hits for monomerid = 50228761
TargetCoagulation factor XI(Homo sapiens (Human))
Johnson & Johnson Pharmaceutical Research & Development
Curated by ChEMBL
LigandPNGBDBM50228761((S)-2-(2-(3-chlorophenyl)-2-oxoacetamido)-N-((S)-5...)
Affinity DataIC50:  250nM. Assay description: Inhibition of human factor 11a
In DepthDetails ArticlePubMed
TargetCoagulation factor XI(Homo sapiens (Human))
Johnson & Johnson Pharmaceutical Research & Development
Curated by ChEMBL
LigandPNGBDBM50228761((S)-2-(2-(3-chlorophenyl)-2-oxoacetamido)-N-((S)-5...)
Affinity DataIC50:  254nM. Assay description: Inhibition of F11a
In DepthDetails ArticlePubMed