BDBM50228830 CHEMBL101505
SMILES COc1ccc(cc1OC1CC2CCC(C2)C1)C1CNC(=O)N1C
InChI Key InChIKey=QPXNZQRARSHZCU-UHFFFAOYSA-N
Data  2 IC50
  Tab Delimited (TSV)   2D SDfile   Computed 3D by Vconf -m prep SDfile
Find this compound or compounds like it in BindingDB:
Activity Spreadsheet -- Enzyme Inhibition Constant Data from BindingDB
Found 2 hits for monomerid = 50228830
TargetcAMP-specific 3',5'-cyclic phosphodiesterase 4C(Rattus norvegicus)
Pfizer
Curated by ChEMBL
LigandPNGBDBM50228830(CHEMBL101505)
Affinity DataIC50: >100nM. Assay description: Inhibition of [3H]- rolipram binding to rat cerebral cortex membranes
In DepthDetails ArticlePubMed
TargetcAMP-specific 3',5'-cyclic phosphodiesterase 4C(Rattus norvegicus)
Pfizer
Curated by ChEMBL
LigandPNGBDBM50228830(CHEMBL101505)
Affinity DataIC50:  2.40E+3nM. Assay description: Inhibition of calcium-independent Phosphodiesterase 4
In DepthDetails ArticlePubMed