BDBM50228862 CHEMBL171141
SMILES O=C(NCc1ccccc1)c1cccnc1OC1CC2CCC1C2
InChI Key InChIKey=YRADNWKOQRRDFI-UHFFFAOYSA-N
Data  2 IC50
  Tab Delimited (TSV)   2D SDfile   Computed 3D by Vconf -m prep SDfile
Find this compound or compounds like it in BindingDB:
Activity Spreadsheet -- Enzyme Inhibition Constant Data from BindingDB
Found 2 hits for monomerid = 50228862
TargetcAMP-specific 3',5'-cyclic phosphodiesterase 4C(Rattus norvegicus)
Pfizer
Curated by ChEMBL
LigandPNGBDBM50228862(CHEMBL171141)
Affinity DataIC50:  2.70E+4nM. Assay description: Inhibition of [3H]rolipram binding to rat brain membranes.
In DepthDetails ArticlePubMed
TargetcAMP-specific 3',5'-cyclic phosphodiesterase 4C(Rattus norvegicus)
Pfizer
Curated by ChEMBL
LigandPNGBDBM50228862(CHEMBL171141)
Affinity DataIC50:  220nM. Assay description: Inhibition of [3H]cAMP (NEN NET-275) binding to Calcium-Independent Phosphodiesterase from rat brain.
In DepthDetails ArticlePubMed