BDBM50228874 CHEMBL102012
SMILES CNNc1[nH]nc(-n2nc(C)cc2C)c2nc3ccccc3c12
InChI Key InChIKey=IKRMUKXFELRXGB-UHFFFAOYSA-N
Data  1 IC50
  Tab Delimited (TSV)   2D SDfile   Computed 3D by Vconf -m prep SDfile
Find this compound or compounds like it in BindingDB:
Activity Spreadsheet -- Enzyme Inhibition Constant Data from BindingDB
Found 1 hit for monomerid = 50228874
TargetcAMP-specific 3',5'-cyclic phosphodiesterase 4A/4B/4C/4D(Homo sapiens (Human))
Universidad De Navarra
Curated by ChEMBL
LigandPNGBDBM50228874(CHEMBL102012)
Affinity DataIC50:  1.18E+5nM. Assay description: Inhibition of canine heart phosphodiesterase 4
In DepthDetails ArticlePubMed