BDBM50228897 CHEMBL109884
SMILES COc1ccc(Cn2cnc3CN([C@@H](Cc23)C(O)=O)C(=O)Cc2ccccc2)cc1C
InChI Key InChIKey=IJPIGRBQCYRUCV-NRFANRHFSA-N
Data  1 IC50
  Tab Delimited (TSV)   2D SDfile   Computed 3D by Vconf -m prep SDfile
Find this compound or compounds like it in BindingDB:
Activity Spreadsheet -- Enzyme Inhibition Constant Data from BindingDB
Found 1 hit for monomerid = 50228897
LigandPNGBDBM50228897(CHEMBL109884)
Affinity DataIC50:  530nM. Assay description: Binding affinity against Angiotensin II receptor, from rat adrenal gland
In DepthDetails ArticlePubMed