BDBM50228902 CHEMBL109561
SMILES COc1ccc(Cn2cnc3CN([C@@H](Cc23)C(O)=O)C(=O)C(c2ccc(cc2)[N+]([O-])=O)c2ccc(cc2)[N+]([O-])=O)cc1C
InChI Key InChIKey=AVMRCXMMAIVHAS-SANMLTNESA-N
Data  1 IC50
  Tab Delimited (TSV)   2D SDfile   Computed 3D by Vconf -m prep SDfile
Find this compound or compounds like it in BindingDB:
Activity Spreadsheet -- Enzyme Inhibition Constant Data from BindingDB
Found 1 hit for monomerid = 50228902
LigandPNGBDBM50228902(CHEMBL109561)
Affinity DataIC50:  1.30E+4nM. Assay description: Binding affinity against Angiotensin II receptor, from rat adrenal gland
In DepthDetails ArticlePubMed