BDBM50228961 CHEMBL2112328
SMILES O.CN(C)c1ccc(Cn2cnc3CN([C@H](Cc23)C(O)=O)C(=O)C(c2ccccc2)c2ccccc2)cc1C
InChI Key InChIKey=YSTVFDAKLDMYCR-MUUNZHRXSA-N
Data  1 IC50
  Tab Delimited (TSV)   2D SDfile   Computed 3D by Vconf -m prep SDfile
Find this compound or compounds like it in BindingDB:
Activity Spreadsheet -- Enzyme Inhibition Constant Data from BindingDB
Found 1 hit for monomerid = 50228961
LigandPNGBDBM50228961(CHEMBL2112328)
Affinity DataIC50:  97nM. Assay description: Binding affinity against Angiotensin II receptor, from rat adrenal gland
In DepthDetails ArticlePubMed