BDBM50229014 CHEMBL110531
SMILES COc1ccc(Cn2cnc3CN([C@@H](Cc23)C(O)=O)C(=O)C(C2CCCC2)c2ccccc2)cc1C
InChI Key InChIKey=UXUCAHGKRZXKNY-PVCWFJFTSA-N
Data  1 IC50
  Tab Delimited (TSV)   2D SDfile   Computed 3D by Vconf -m prep SDfile
Find this compound or compounds like it in BindingDB:
Activity Spreadsheet -- Enzyme Inhibition Constant Data from BindingDB
Found 1 hit for monomerid = 50229014
LigandPNGBDBM50229014(CHEMBL110531)
Affinity DataIC50:  67nM. Assay description: Binding affinity against Angiotensin II receptor, from rat adrenal gland
In DepthDetails ArticlePubMed