BDBM50229019 CHEMBL112810
SMILES OC(=O)C1Cc2c(CN1C(=O)c1cccc3ccccc13)ncn2Cc1ccccc1
InChI Key InChIKey=QMCHWKBTCHDOPW-UHFFFAOYSA-N
Data  1 IC50
  Tab Delimited (TSV)   2D SDfile   Computed 3D by Vconf -m prep SDfile
Find this compound or compounds like it in BindingDB:
Activity Spreadsheet -- Enzyme Inhibition Constant Data from BindingDB
Found 1 hit for monomerid = 50229019
LigandPNGBDBM50229019(CHEMBL112810)
Affinity DataIC50:  9.80E+3nM. Assay description: Binding affinity against Angiotensin II receptor, from rat adrenal gland
In DepthDetails ArticlePubMed