BDBM50229024 CHEMBL3349372
SMILES CC(C)c1c(O)c(O)c(\C=N\O)c2c(O)c(c(C)cc12)-c1c(C)cc2c(C(C)C)c(O)c(O)c(\C=N\O)c2c1O
InChI Key InChIKey=UMROJVTVEZTZQH-BQVZVJNFSA-N
Data  1 KI
  Tab Delimited (TSV)   2D SDfile   Computed 3D by Vconf -m prep SDfile
Find this compound or compounds like it in BindingDB:
Activity Spreadsheet -- Enzyme Inhibition Constant Data from BindingDB
Found 1 hit for monomerid = 50229024
TargetAldo-keto reductase family 1 member B1(Homo sapiens (Human))
University Of New Mexico School Of Medicine
Curated by ChEMBL
LigandPNGBDBM50229024(CHEMBL3349372)
Affinity DataKi:  7.80E+3nM. Assay description: The compound was tested for inhibitory activity against Aldose reductase from human placenta
In DepthDetails ArticlePubMed