BDBM50229034 CHEMBL112438
SMILES [H][C@@]12CC(C)=CC[C@@]1([H])C(C)(C)Oc1cc(CCCCC)cc(OCCN3CCOCC3)c21
InChI Key InChIKey=CSZHPJDQORYZKU-DHIUTWEWSA-N
Data  1 IC50
  Tab Delimited (TSV)   2D SDfile   Computed 3D by Vconf -m prep SDfile
Find this compound or compounds like it in BindingDB:
Activity Spreadsheet -- Enzyme Inhibition Constant Data from BindingDB
Found 1 hit for monomerid = 50229034
TargetCannabinoid receptor 1/2(Rattus norvegicus (Rat))
Virginia Commonwealth University
Curated by ChEMBL
LigandPNGBDBM50229034(CHEMBL112438)
Affinity DataIC50:  4.30E+3nM. Assay description: The compound was tested in vitro for binding activity against THC cannabinoid receptor site, using 3H-CP-55940 as the radioligand.
In DepthDetails ArticlePubMed