BDBM50229235 CHEMBL46610
SMILES O=C1N(Cc2ccccc2)Cc2c1n(Cc1ccccc1)c1cc(nn1c2=O)-c1ccccc1
InChI Key InChIKey=ITOQNPSPXOMIFN-UHFFFAOYSA-N
Data  1 IC50
  Tab Delimited (TSV)   2D SDfile   Computed 3D by Vconf -m prep SDfile
Find this compound or compounds like it in BindingDB:
Activity Spreadsheet -- Enzyme Inhibition Constant Data from BindingDB
Found 1 hit for monomerid = 50229235
TargetSterol O-acyltransferase 1(Rattus norvegicus)
Upjohn
Curated by ChEMBL
LigandPNGBDBM50229235(CHEMBL46610)
Affinity DataIC50:  1.05E+4nM. Assay description: In vitro inhibition of Fu5AH acyl coenzyme A:cholesterol acyltransferase.
In DepthDetails ArticlePubMed