BDBM50229394 CHEMBL76059
SMILES CN(C)C(=O)N(C)CC#CCn1ccnc1
InChI Key InChIKey=FSEQWXVAKCSDHE-UHFFFAOYSA-N
Data  2 KI
  Tab Delimited (TSV)   2D SDfile   Computed 3D by Vconf -m prep SDfile
Find this compound or compounds like it in BindingDB:
Activity Spreadsheet -- Enzyme Inhibition Constant Data from BindingDB
Found 2 hits for monomerid = 50229394
LigandPNGBDBM50229394(CHEMBL76059)
Affinity DataKi:  15nM. Assay description: Binding affinity to muscarinic acetylcholine receptor was determined in presence of [3H]OXO-M radioligand (in vitro)
In DepthDetails ArticlePubMed
LigandPNGBDBM50229394(CHEMBL76059)
Affinity DataKi: >1.00E+4nM. Assay description: Binding affinity to muscarinic acetylcholine receptor was determined in presence of [3H]QNB radioligand (in vitro)
In DepthDetails ArticlePubMed