BDBM50229401 CHEMBL76995
SMILES O=C1CCCN1CC#CCn1cnc2ccccc12
InChI Key InChIKey=MGQWTIYMSGCIND-UHFFFAOYSA-N
Data  2 KI
  Tab Delimited (TSV)   2D SDfile   Computed 3D by Vconf -m prep SDfile
Find this compound or compounds like it in BindingDB:
Activity Spreadsheet -- Enzyme Inhibition Constant Data from BindingDB
Found 2 hits for monomerid = 50229401
LigandPNGBDBM50229401(CHEMBL76995)
Affinity DataKi: >1.00E+4nM. Assay description: Binding affinity to muscarinic acetylcholine receptor was determined in presence of [3H]OXO-M radioligand (in vitro)
In DepthDetails ArticlePubMed
LigandPNGBDBM50229401(CHEMBL76995)
Affinity DataKi: >1.00E+4nM. Assay description: Binding affinity to muscarinic acetylcholine receptor was determined in presence of [3H]QNB radioligand (in vitro)
In DepthDetails ArticlePubMed