BDBM50229444 CHEMBL315386
SMILES CCCCc1nc(Cl)c(COC(C)=O)n1Cc1ccc(cc1)-c1ccccc1C(O)=O
InChI Key InChIKey=ASBBZPNAKJNANA-UHFFFAOYSA-N
Data  2 IC50
  Tab Delimited (TSV)   2D SDfile   Computed 3D by Vconf -m prep SDfile
Find this compound or compounds like it in BindingDB:
Activity Spreadsheet -- Enzyme Inhibition Constant Data from BindingDB
Found 2 hits for monomerid = 50229444
TargetType-1 angiotensin II receptor A/B(RAT)
University Of Innsbruck
Curated by ChEMBL
LigandPNGBDBM50229444(CHEMBL315386)
Affinity DataIC50:  3.33E+3nM. Assay description: Inhibitory concentration that gives 50% displacement of specific binding at labeled angiotensin II type 1 receptor in rat adrenal cortical membranes.
In DepthDetails ArticlePubMed
LigandPNGBDBM50229444(CHEMBL315386)
Affinity DataIC50:  330nM. Assay description: Inhibition of radioligand [3H]angiotensin II binding to angiotensin II receptor of rat adrenal cortical membrane
In DepthDetails ArticlePubMed