BDBM50229516 CHEMBL2367763
SMILES [H][C@@]12Cc3ccc(O)cc3[C@](C)(CCN1C[C@@H]1CC(=C)C(=O)O1)[C@@H]2C
InChI Key InChIKey=FXAWKCNYVHSHJZ-BUJNREJVSA-N
Data  1 IC50
  Tab Delimited (TSV)   2D SDfile   Computed 3D by Vconf -m prep SDfile
Find this compound or compounds like it in BindingDB:
Activity Spreadsheet -- Enzyme Inhibition Constant Data from BindingDB
Found 1 hit for monomerid = 50229516
TargetDelta-type/Kappa-type/Mu-type opioid receptor(Homo sapiens (Human))
University Of Washington
Curated by ChEMBL
LigandPNGBDBM50229516(CHEMBL2367763)
Affinity DataIC50:  1.30E+3nM. Assay description: Displacement of 0.5 nM [3H]bremazocine from opioid receptor sites in guinea pig membranes
In DepthDetails ArticlePubMed