BDBM50229564 CHEMBL98269
SMILES COc1cc2cc3[nH]c(O)nc3nc2cc1OC
InChI Key InChIKey=CKJZPMFALWTSJS-UHFFFAOYSA-N
Data  1 IC50
  Tab Delimited (TSV)   2D SDfile   Computed 3D by Vconf -m prep SDfile
Find this compound or compounds like it in BindingDB:
Activity Spreadsheet -- Enzyme Inhibition Constant Data from BindingDB
Found 1 hit for monomerid = 50229564
TargetcGMP-inhibited 3',5'-cyclic phosphodiesterase 3A/3B(Homo sapiens (Human))
Bristol-Myers Squibb Pharmaceutical Research Institute
Curated by ChEMBL
LigandPNGBDBM50229564(CHEMBL98269)
Affinity DataIC50:  5nM. Assay description: Inhibition of hydrolysis of c-AMP phosphodiesterase in human platelets
In DepthDetails ArticlePubMed