BDBM50229578 CHEMBL65191
SMILES CCCCCCC(C)(C)c1cc(O)c2C3CC(CO)=CCC3C(C)(C)Oc2c1
InChI Key InChIKey=SSQJFGMEZBFMNV-UHFFFAOYSA-N
Data  1 KI
  Tab Delimited (TSV)   2D SDfile   Computed 3D by Vconf -m prep SDfile
Find this compound or compounds like it in BindingDB:
Activity Spreadsheet -- Enzyme Inhibition Constant Data from BindingDB
Found 1 hit for monomerid = 50229578
TargetCannabinoid receptor 1/2(Rattus norvegicus (Rat))
Hebrew University
Curated by ChEMBL
LigandPNGBDBM50229578(CHEMBL65191)
Affinity DataKi:  466nM. Assay description: Compound was evaluated for the competitive inhibition of [3H]3-(1,1-Dimethyl-heptyl)-9-hydroxymethyl-6,6-dimethyl-6a,7,8,9,10,10a-hexahydro-6H-benzo[...
In DepthDetails ArticlePubMed