BDBM50229759 CHEMBL313245
SMILES CC(C)(C)c1cc(cc(c1O)C(C)(C)C)-c1cn2ncc(=O)nc2s1
InChI Key InChIKey=LFPZRJGMGGLCKX-UHFFFAOYSA-N
Data  1 IC50
  Tab Delimited (TSV)   2D SDfile   Computed 3D by Vconf -m prep SDfile
Find this compound or compounds like it in BindingDB:
Activity Spreadsheet -- Enzyme Inhibition Constant Data from BindingDB
Found 1 hit for monomerid = 50229759
TargetProstaglandin G/H synthase 1/2(Homo sapiens (Human))
Wyeth-Ayerst Research
Curated by ChEMBL
LigandPNGBDBM50229759(CHEMBL313245)
Affinity DataIC50:  2.50E+4nM. Assay description: The compound was tested for inhibitory activity against Prostaglandin G/H synthase in human polymorphonuclear leukocytes[PMNS]
In DepthDetails ArticlePubMed