BDBM50229789 CHEMBL327786
SMILES O=C(CCCOc1ccc2N=C3NC(=O)CN3Cc2c1)N1CCN(CC2CCCCC2)CC1
InChI Key InChIKey=UXXHMDVOJBATJP-UHFFFAOYSA-N
Data  1 IC50
  Tab Delimited (TSV)   2D SDfile   Computed 3D by Vconf -m prep SDfile
Find this compound or compounds like it in BindingDB:
Activity Spreadsheet -- Enzyme Inhibition Constant Data from BindingDB
Found 1 hit for monomerid = 50229789
TargetcGMP-inhibited 3',5'-cyclic phosphodiesterase 3A/3B(Homo sapiens (Human))
Bristol-Myers Squibb Pharmaceutical Research Institute
Curated by ChEMBL
LigandPNGBDBM50229789(CHEMBL327786)
Affinity DataIC50:  6nM. Assay description: Inhibition of human platelet c-AMP phosphodiesterase PDE 3
In DepthDetails ArticlePubMed