BDBM50229799 CHEMBL330737
SMILES Oc1nc2cc3cc(OCCCC(=O)N4CCN(Cc5ccc(Cl)cc5)CC4)ccc3[nH]c2n1
InChI Key InChIKey=QLIMRQGAVDLCNB-UHFFFAOYSA-N
Data  1 IC50
  Tab Delimited (TSV)   2D SDfile   Computed 3D by Vconf -m prep SDfile
Find this compound or compounds like it in BindingDB:
Activity Spreadsheet -- Enzyme Inhibition Constant Data from BindingDB
Found 1 hit for monomerid = 50229799
TargetcGMP-inhibited 3',5'-cyclic phosphodiesterase 3A/3B(Homo sapiens (Human))
Bristol-Myers Squibb Pharmaceutical Research Institute
Curated by ChEMBL
LigandPNGBDBM50229799(CHEMBL330737)
Affinity DataIC50:  2nM. Assay description: Inhibition of human platelet c-AMP phosphodiesterase PDE 3
In DepthDetails ArticlePubMed