BDBM50229804 CHEMBL90647
SMILES Oc1nc2cc3cc(OCCCC(=O)N4CCN(CC4)C(c4ccc(F)cc4)c4ccc(F)cc4)ccc3[nH]c2n1
InChI Key InChIKey=YDKKNLYJPBDWAO-UHFFFAOYSA-N
Data  1 IC50
  Tab Delimited (TSV)   2D SDfile   Computed 3D by Vconf -m prep SDfile
Find this compound or compounds like it in BindingDB:
Activity Spreadsheet -- Enzyme Inhibition Constant Data from BindingDB
Found 1 hit for monomerid = 50229804
TargetcGMP-inhibited 3',5'-cyclic phosphodiesterase 3A/3B(Homo sapiens (Human))
Bristol-Myers Squibb Pharmaceutical Research Institute
Curated by ChEMBL
LigandPNGBDBM50229804(CHEMBL90647)
Affinity DataIC50:  0.300nM. Assay description: Inhibition of human platelet c-AMP phosphodiesterase PDE 3
In DepthDetails ArticlePubMed