BDBM50229823 CHEMBL328987
SMILES COc1ccc(cc1OC)C(=O)N1CCN(CC1)c1ccc2[nH]c3nc(O)nc3cc2c1
InChI Key InChIKey=GCOZQYPMZQWMGV-UHFFFAOYSA-N
Data  1 IC50
  Tab Delimited (TSV)   2D SDfile   Computed 3D by Vconf -m prep SDfile
Find this compound or compounds like it in BindingDB:
Activity Spreadsheet -- Enzyme Inhibition Constant Data from BindingDB
Found 1 hit for monomerid = 50229823
TargetcGMP-inhibited 3',5'-cyclic phosphodiesterase 3A/3B(Homo sapiens (Human))
Bristol-Myers Squibb Pharmaceutical Research Institute
Curated by ChEMBL
LigandPNGBDBM50229823(CHEMBL328987)
Affinity DataIC50:  300nM. Assay description: Inhibition of human platelet c-AMP phosphodiesterase PDE 3
In DepthDetails ArticlePubMed