BDBM50229858 CHEMBL101730
SMILES NCc1cccc(Nc2nc(O)c3[nH]cnc3n2)c1
InChI Key InChIKey=BRHVTNIXPRLEBL-UHFFFAOYSA-N
Data  2 IC50
  Tab Delimited (TSV)   2D SDfile   Computed 3D by Vconf -m prep SDfile
Find this compound or compounds like it in BindingDB:
Activity Spreadsheet -- Enzyme Inhibition Constant Data from BindingDB
Found 2 hits for monomerid = 50229858
TargetThymidine kinase(Human herpesvirus 2)
University Of Massachusetts Medical School
Curated by ChEMBL
LigandPNGBDBM50229858(CHEMBL101730)
Affinity DataIC50:  2.00E+4nM. Assay description: Inhibitory activity against HSV-2 thymidine kinase isolated from HeLa cells
In DepthDetails ArticlePubMed
TargetThymidine kinase(Human herpesvirus 1 (strain SC16) (HHV-1) (Human h...)
University Of Massachusetts Medical School
Curated by ChEMBL
LigandPNGBDBM50229858(CHEMBL101730)
Affinity DataIC50:  3.02E+4nM. Assay description: Inhibitory activity against HSV-1 thymidine kinase isolated from HeLa cells
In DepthDetails ArticlePubMed