BDBM50229890 CHEMBL538918
SMILES CCCCCCCCNc1cc(C)nc2ccc(NC(=O)\C=C\c3ccccc3Cl)cc12
InChI Key InChIKey=CWQLRNHZQNXHEL-DTQAZKPQSA-N
Data  1 IC50
  Tab Delimited (TSV)   2D SDfile   Computed 3D by Vconf -m prep SDfile
Find this compound or compounds like it in BindingDB:
Activity Spreadsheet -- Enzyme Inhibition Constant Data from BindingDB
Found 1 hit for monomerid = 50229890
TargetC5a anaphylatoxin chemotactic receptor 1(Homo sapiens (Human))
Merck Sharp And Dohme Research Laboratories
Curated by ChEMBL
LigandPNGBDBM50229890(CHEMBL538918)
Affinity DataIC50: >2.22E+5nM. Assay description: Ability to inhibit binding of radiolabeled C5a anaphylatoxin to intact membrane bound receptor from human neutrophils.
In DepthDetails ArticlePubMed