BDBM50229892 CHEMBL314406
SMILES Cc1cc(N)c2cc(ccc2n1)C(=O)NCc1ccccc1
InChI Key InChIKey=JCJTZFMGKDYEKW-UHFFFAOYSA-N
Data  1 IC50
  Tab Delimited (TSV)   2D SDfile   Computed 3D by Vconf -m prep SDfile
Find this compound or compounds like it in BindingDB:
Activity Spreadsheet -- Enzyme Inhibition Constant Data from BindingDB
Found 1 hit for monomerid = 50229892
TargetC5a anaphylatoxin chemotactic receptor 1(Homo sapiens (Human))
Merck Sharp And Dohme Research Laboratories
Curated by ChEMBL
LigandPNGBDBM50229892(CHEMBL314406)
Affinity DataIC50: >3.43E+5nM. Assay description: Ability to inhibit binding of radiolabeled C5a anaphylatoxin to intact membrane bound receptor from human neutrophils.
In DepthDetails ArticlePubMed