BDBM50229917 CHEMBL100289
SMILES [H][C@](N)(CCCCN)C(=O)NCC1CCCCN1C(=O)CCCCCCCCCCCCCCC
InChI Key InChIKey=TWUYFJVHROCHBJ-AMVUTOCUSA-N
Data  1 IC50
  Tab Delimited (TSV)   2D SDfile   Computed 3D by Vconf -m prep SDfile
Find this compound or compounds like it in BindingDB:
Activity Spreadsheet -- Enzyme Inhibition Constant Data from BindingDB
Found 1 hit for monomerid = 50229917
TargetProtein kinase C alpha/beta/gamma type(Rattus norvegicus (Rat))
Nova Pharmaceutical
Curated by ChEMBL
LigandPNGBDBM50229917(CHEMBL100289)
Affinity DataIC50:  4.50E+4nM. Assay description: In vitro inhibition of [32P] incorporation into histones by rat brain partially purified Protein kinase C in the presence of PMA, [Ca2+] and phosphat...
In DepthDetails ArticlePubMed