BDBM50229964 CHEMBL150615
SMILES [H][C@@]12CC=CCC1(CCN(CC1CCC1)C2)c1cccc(O)c1
InChI Key InChIKey=XJSVYDYOYYFRFT-LROBGIAVSA-N
Data  1 IC50
  Tab Delimited (TSV)   2D SDfile   Computed 3D by Vconf -m prep SDfile
Find this compound or compounds like it in BindingDB:
Activity Spreadsheet -- Enzyme Inhibition Constant Data from BindingDB
Found 1 hit for monomerid = 50229964
TargetDelta-type/Kappa-type/Mu-type opioid receptor(Homo sapiens (Human))
Glaxo Group Research
Curated by ChEMBL
LigandPNGBDBM50229964(CHEMBL150615)
Affinity DataIC50:  60nM. Assay description: In vitro inhibitory activity against opioid receptor in Guinea pig ileum
In DepthDetails ArticlePubMed