BDBM50230041 CHEMBL3349496
SMILES [H][C@@](O)(CN1CCC[C@H]1C(=O)N[C@@H]([C@@H](C)CC)C(=O)N[C@@H](Cc1ccccc1)C(=O)OC)[C@H](Cc1ccccc1)NC(=O)[C@H](CC(N)=O)NC(=O)OCc1ccccc1
InChI Key InChIKey=QDSIURMOHBBWLV-BBBVZJOMSA-N
Data  1 KI
  Tab Delimited (TSV)   2D SDfile   Computed 3D by Vconf -m prep SDfile
Find this compound or compounds like it in BindingDB:
Activity Spreadsheet -- Enzyme Inhibition Constant Data from BindingDB
Found 1 hit for monomerid = 50230041
TargetGag-Pol polyprotein [489-587](Human immunodeficiency virus type 1)
University Of Wisconsin-Madison
Curated by ChEMBL
LigandPNGBDBM50230041(CHEMBL3349496)
Affinity DataKi:  1nM. Assay description: Binding affinity to HIV protease
In DepthDetails ArticlePubMed