BDBM50230045 CHEMBL340726
SMILES [Na+].CC(Oc1cccc(\C=C/c2ccc3ccc(Cl)cc3n2)c1)C([O-])=O
InChI Key InChIKey=DPZUSHRCNUILPA-UYTGOYFPSA-M
Data  1 IC50
  Tab Delimited (TSV)   2D SDfile   Computed 3D by Vconf -m prep SDfile
Find this compound or compounds like it in BindingDB:
Activity Spreadsheet -- Enzyme Inhibition Constant Data from BindingDB
Found 1 hit for monomerid = 50230045
TargetCysteinyl leukotriene receptor 1/2(Homo sapiens (Human))
Merck Frosst Centre For Therapeutic Research
Curated by ChEMBL
LigandPNGBDBM50230045(CHEMBL340726)
Affinity DataIC50:  15nM. Assay description: Inhibition of human carbonic anhydrase II
In DepthDetails ArticlePubMed