BDBM50230085 CHEMBL126359
SMILES CCCCc1ncc(\C=C(/Cc2ccc(OC)cc2)C(O)=O)n1Cc1ccccc1Cl
InChI Key InChIKey=UXBPVWAZTDUORJ-HMMYKYKNSA-N
Data  1 IC50
  Tab Delimited (TSV)   2D SDfile   Computed 3D by Vconf -m prep SDfile
Find this compound or compounds like it in BindingDB:
Activity Spreadsheet -- Enzyme Inhibition Constant Data from BindingDB
Found 1 hit for monomerid = 50230085
LigandPNGBDBM50230085(CHEMBL126359)
Affinity DataIC50:  810nM. Assay description: Inhibition of human carbonic anhydrase II
In DepthDetails ArticlePubMed