BDBM50230094 CHEMBL127308
SMILES CCCCc1ncc(\C=C(/CCc2ccccc2)C(O)=O)n1Cc1ccccc1Cl
InChI Key InChIKey=SXZMGFRTEQNQIN-CAPFRKAQSA-N
Data  1 IC50
  Tab Delimited (TSV)   2D SDfile   Computed 3D by Vconf -m prep SDfile
Find this compound or compounds like it in BindingDB:
Activity Spreadsheet -- Enzyme Inhibition Constant Data from BindingDB
Found 1 hit for monomerid = 50230094
LigandPNGBDBM50230094(CHEMBL127308)
Affinity DataIC50:  2.90E+3nM. Assay description: Inhibition of [125I]angiotensin II specific binding to rat mesenteric arteries
In DepthDetails ArticlePubMed