BDBM50230097 CHEMBL434254
SMILES CCCCc1ncc(\C=C(\C(O)=O)c2ccccc2)n1Cc1ccccc1Cl
InChI Key InChIKey=FCVOEGWDKXYXDL-XSFVSMFZSA-N
Data  1 IC50
  Tab Delimited (TSV)   2D SDfile   Computed 3D by Vconf -m prep SDfile
Find this compound or compounds like it in BindingDB:
Activity Spreadsheet -- Enzyme Inhibition Constant Data from BindingDB
Found 1 hit for monomerid = 50230097
LigandPNGBDBM50230097(CHEMBL434254)
Affinity DataIC50:  2.01E+4nM. Assay description: Inhibition of [125I]angiotensin II specific binding to rat mesenteric arteries
In DepthDetails ArticlePubMed